Skip to content

test(spring-boot): [Sample Tests 9] Move the Boot 3 GraphQL tests into the module #14039

test(spring-boot): [Sample Tests 9] Move the Boot 3 GraphQL tests into the module

test(spring-boot): [Sample Tests 9] Move the Boot 3 GraphQL tests into the module #14039

Triggered via pull request October 23, 2026 09:35
Status Success
Total duration 12m 52s
Artifacts 6

agp-matrix.yml

on: pull_request
Matrix: agp-matrix-compatibility
Fit to window
Zoom out
Zoom in

Annotations

11 errors, 18 warnings, and 6 notices
io.sentry.uitest.android.UserInteractionTests ► composableSwipeGeneratesMatchingBreadcrumb: sentry-android-integration-tests/sentry-uitest-android/build/outputs/androidTest-results/connected/release/TEST-test(AVD) - 11.xml#L0
Failed test found in: sentry-android-integration-tests/sentry-uitest-android/build/outputs/androidTest-results/connected/release/TEST-test(AVD) - 11.xml Error: org.junit.AssumptionViolatedException: got: <false>, expected: is <true>
io.sentry.uitest.android.UserInteractionTests ► composableClickGeneratesMatchingBreadcrumb: sentry-android-integration-tests/sentry-uitest-android/build/outputs/androidTest-results/connected/release/TEST-test(AVD) - 11.xml#L0
Failed test found in: sentry-android-integration-tests/sentry-uitest-android/build/outputs/androidTest-results/connected/release/TEST-test(AVD) - 11.xml Error: org.junit.AssumptionViolatedException: got: <false>, expected: is <true>
io.sentry.uitest.android.ReplayTest ► composeReplayDoesNotLeak: sentry-android-integration-tests/sentry-uitest-android/build/outputs/androidTest-results/connected/release/TEST-test(AVD) - 11.xml#L0
Failed test found in: sentry-android-integration-tests/sentry-uitest-android/build/outputs/androidTest-results/connected/release/TEST-test(AVD) - 11.xml Error: org.junit.AssumptionViolatedException: got: <false>, expected: is <true>
io.sentry.uitest.android.EnvelopeTests ► checkEnvelopeProfiledTransaction: sentry-android-integration-tests/sentry-uitest-android/build/outputs/androidTest-results/connected/release/TEST-test(AVD) - 11.xml#L0
Failed test found in: sentry-android-integration-tests/sentry-uitest-android/build/outputs/androidTest-results/connected/release/TEST-test(AVD) - 11.xml Error: org.junit.AssumptionViolatedException: got: <[null]>, expected: every item is not null
io.sentry.uitest.android.EnvelopeTests ► checkTimedOutProfile: sentry-android-integration-tests/sentry-uitest-android/build/outputs/androidTest-results/connected/release/TEST-test(AVD) - 11.xml#L0
Failed test found in: sentry-android-integration-tests/sentry-uitest-android/build/outputs/androidTest-results/connected/release/TEST-test(AVD) - 11.xml Error: org.junit.AssumptionViolatedException: Sometimes traceFile does not exist for profiles on emulators and it fails. Although, Android Runtime is the one that manages the file, so something must be wrong with Debug.startMethodTracing
io.sentry.uitest.android.AutomaticSpansTest ► checkAppStartFramesMeasurements: sentry-android-integration-tests/sentry-uitest-android/build/outputs/androidTest-results/connected/release/TEST-test(AVD) - 11.xml#L0
Failed test found in: sentry-android-integration-tests/sentry-uitest-android/build/outputs/androidTest-results/connected/release/TEST-test(AVD) - 11.xml Error: org.junit.AssumptionViolatedException: got: <false>, expected: is <true>
io.sentry.uitest.android.ReplayTest ► composeReplayDoesNotLeak: sentry-android-integration-tests/sentry-uitest-android/build/outputs/androidTest-results/connected/release/TEST-test(AVD) - 11.xml#L0
Failed test found in: sentry-android-integration-tests/sentry-uitest-android/build/outputs/androidTest-results/connected/release/TEST-test(AVD) - 11.xml Error: org.junit.AssumptionViolatedException: got: <false>, expected: is <true>
io.sentry.uitest.android.ReplaySnapshotTest ► captureComposeReplayFrameSnapshots: sentry-android-integration-tests/sentry-uitest-android/build/outputs/androidTest-results/connected/release/TEST-test(AVD) - 11.xml#L0
Failed test found in: sentry-android-integration-tests/sentry-uitest-android/build/outputs/androidTest-results/connected/release/TEST-test(AVD) - 11.xml Error: org.junit.AssumptionViolatedException: got: <false>, expected: is <true>
io.sentry.uitest.android.EnvelopeTests ► checkEnvelopeProfiledTransaction: sentry-android-integration-tests/sentry-uitest-android/build/outputs/androidTest-results/connected/release/TEST-test(AVD) - 11.xml#L0
Failed test found in: sentry-android-integration-tests/sentry-uitest-android/build/outputs/androidTest-results/connected/release/TEST-test(AVD) - 11.xml Error: org.junit.AssumptionViolatedException: got: <[null]>, expected: every item is not null
io.sentry.uitest.android.EnvelopeTests ► checkTimedOutProfile: sentry-android-integration-tests/sentry-uitest-android/build/outputs/androidTest-results/connected/release/TEST-test(AVD) - 11.xml#L0
Failed test found in: sentry-android-integration-tests/sentry-uitest-android/build/outputs/androidTest-results/connected/release/TEST-test(AVD) - 11.xml Error: org.junit.AssumptionViolatedException: Sometimes traceFile does not exist for profiles on emulators and it fails. Although, Android Runtime is the one that manages the file, so something must be wrong with Debug.startMethodTracing
io.sentry.uitest.android.AutomaticSpansTest ► checkAppStartFramesMeasurements: sentry-android-integration-tests/sentry-uitest-android/build/outputs/androidTest-results/connected/release/TEST-test(AVD) - 11.xml#L0
Failed test found in: sentry-android-integration-tests/sentry-uitest-android/build/outputs/androidTest-results/connected/release/TEST-test(AVD) - 11.xml Error: org.junit.AssumptionViolatedException: got: <false>, expected: is <true>
AGP Matrix Release - AGP 9.0.0 - Integrations true
Failed to restore: Failed to GetCacheEntryDownloadURL: Rate limited: Failed request: (429) Too Many Requests: rate limit exceeded
AGP Matrix Release - AGP 9.0.0 - Integrations true
You've hit a rate limit, your rate limit will reset in 18 seconds
AGP Matrix Release - AGP 9.2.1 - Integrations true
Failed to restore: Failed to GetCacheEntryDownloadURL: Rate limited: Failed request: (429) Too Many Requests: rate limit exceeded
AGP Matrix Release - AGP 9.2.1 - Integrations true
You've hit a rate limit, your rate limit will reset in 18 seconds
AGP Matrix Release - AGP 9.4.0 - Integrations false
Failed to restore: Failed to GetCacheEntryDownloadURL: Rate limited: Failed request: (429) Too Many Requests: rate limit exceeded
AGP Matrix Release - AGP 9.4.0 - Integrations false
You've hit a rate limit, your rate limit will reset in 16 seconds
AGP Matrix Release - AGP 9.0.0 - Integrations false
Failed to restore: Failed to GetCacheEntryDownloadURL: Rate limited: Failed request: (429) Too Many Requests: rate limit exceeded
AGP Matrix Release - AGP 9.0.0 - Integrations false
You've hit a rate limit, your rate limit will reset in 22 seconds
AGP Matrix Release - AGP 9.0.0 - Integrations false
Failed to restore gradle-home-v2|Linux-X64|agp-matrix-compatibility[cef0db88047ff7046585672943c7c15b]-3c182d00afc6a31cead356145e6dd9a77562ffd3: Error: Failed to GetCacheEntryDownloadURL: Rate limited: Failed request: (429) Too Many Requests: rate limit exceeded
AGP Matrix Release - AGP 9.0.0 - Integrations false
You've hit a rate limit, your rate limit will reset in 22 seconds
AGP Matrix Release - AGP 9.2.1 - Integrations false
Failed to restore: Failed to GetCacheEntryDownloadURL: Rate limited: Failed request: (429) Too Many Requests: rate limit exceeded
AGP Matrix Release - AGP 9.2.1 - Integrations false
You've hit a rate limit, your rate limit will reset in 23 seconds
AGP Matrix Release - AGP 9.2.1 - Integrations false
Failed to restore gradle-home-v2|Linux-X64|agp-matrix-compatibility[dfe26173bcc1e7d4a93b4512afcb7b6e]-3c182d00afc6a31cead356145e6dd9a77562ffd3: Error: Failed to GetCacheEntryDownloadURL: Rate limited: Failed request: (429) Too Many Requests: rate limit exceeded
AGP Matrix Release - AGP 9.2.1 - Integrations false
You've hit a rate limit, your rate limit will reset in 24 seconds
AGP Matrix Release - AGP 9.4.0 - Integrations true
Failed to restore: Failed to GetCacheEntryDownloadURL: Rate limited: Failed request: (429) Too Many Requests: rate limit exceeded
AGP Matrix Release - AGP 9.4.0 - Integrations true
You've hit a rate limit, your rate limit will reset in 20 seconds
AGP Matrix Release - AGP 9.4.0 - Integrations true
Failed to restore gradle-home-v2|Linux-X64|agp-matrix-compatibility[fce0e0853ecbba012de9a442479b7be7]-3c182d00afc6a31cead356145e6dd9a77562ffd3: Error: Failed to GetCacheEntryDownloadURL: Rate limited: Failed request: (429) Too Many Requests: rate limit exceeded
AGP Matrix Release - AGP 9.4.0 - Integrations true
You've hit a rate limit, your rate limit will reset in 20 seconds
AGP Matrix Release - AGP 9.0.0 - Integrations true
"The ubuntu-latest label will migrate to Ubuntu 26 beginning October 19, 2026. For more information, see https://github.com/actions/runner-images/issues/14748"
AGP Matrix Release - AGP 9.2.1 - Integrations true
"The ubuntu-latest label will migrate to Ubuntu 26 beginning October 19, 2026. For more information, see https://github.com/actions/runner-images/issues/14748"
AGP Matrix Release - AGP 9.4.0 - Integrations false
"The ubuntu-latest label will migrate to Ubuntu 26 beginning October 19, 2026. For more information, see https://github.com/actions/runner-images/issues/14748"
AGP Matrix Release - AGP 9.0.0 - Integrations false
"The ubuntu-latest label will migrate to Ubuntu 26 beginning October 19, 2026. For more information, see https://github.com/actions/runner-images/issues/14748"
AGP Matrix Release - AGP 9.2.1 - Integrations false
"The ubuntu-latest label will migrate to Ubuntu 26 beginning October 19, 2026. For more information, see https://github.com/actions/runner-images/issues/14748"
AGP Matrix Release - AGP 9.4.0 - Integrations true
"The ubuntu-latest label will migrate to Ubuntu 26 beginning October 19, 2026. For more information, see https://github.com/actions/runner-images/issues/14748"

Artifacts

Produced during runtime
Name Size Digest
test-results-AGP9.0.0-Integrationsfalse
7.18 MB
sha256:086900684ac885d5926354729b3e7f582b573a6cc4645932859b98bdffd2d26e
test-results-AGP9.0.0-Integrationstrue
7.31 MB
sha256:17f76dbc4682e4406ac4583ef884bde3a3c86dead017507210feafeafc7e6c77
test-results-AGP9.2.1-Integrationsfalse
19.1 MB
sha256:2f76baf0c678512f4e54cd626fac9992dcce1baf9ddc663388ff54a6261e4f34
test-results-AGP9.2.1-Integrationstrue
19.5 MB
sha256:41e0f29185d2898937b0aef0e156f31bf02b28416038aeb151d506db2f43db71
test-results-AGP9.4.0-Integrationsfalse
19.4 MB
sha256:892c2ec2242da57b1fa5fc5323a40482402d194758c5f31161e52a69eb49ca7a
test-results-AGP9.4.0-Integrationstrue
19.8 MB
sha256:fdf33dfac8c85c3bc4f8451a041c9bac8b318807da60bc4917647d73e9463ff9