Skip to content

test: [Sample Tests 38] Remove the system-test runner and its Python mock server #14291

test: [Sample Tests 38] Remove the system-test runner and its Python mock server

test: [Sample Tests 38] Remove the system-test runner and its Python mock server #14291

Triggered via pull request October 23, 2026 15:12
Status Success
Total duration 12m 10s
Artifacts 6

agp-matrix.yml

on: pull_request
Matrix: agp-matrix-compatibility
Fit to window
Zoom out
Zoom in

Annotations

11 errors, 12 warnings, and 6 notices
io.sentry.uitest.android.ReplayTest ► composeReplayDoesNotLeak: sentry-android-integration-tests/sentry-uitest-android/build/outputs/androidTest-results/connected/release/TEST-test(AVD) - 11.xml#L0
Failed test found in: sentry-android-integration-tests/sentry-uitest-android/build/outputs/androidTest-results/connected/release/TEST-test(AVD) - 11.xml Error: org.junit.AssumptionViolatedException: got: <false>, expected: is <true>
io.sentry.uitest.android.ReplaySnapshotTest ► captureComposeReplayFrameSnapshots: sentry-android-integration-tests/sentry-uitest-android/build/outputs/androidTest-results/connected/release/TEST-test(AVD) - 11.xml#L0
Failed test found in: sentry-android-integration-tests/sentry-uitest-android/build/outputs/androidTest-results/connected/release/TEST-test(AVD) - 11.xml Error: org.junit.AssumptionViolatedException: got: <false>, expected: is <true>
io.sentry.uitest.android.EnvelopeTests ► checkEnvelopeProfiledTransaction: sentry-android-integration-tests/sentry-uitest-android/build/outputs/androidTest-results/connected/release/TEST-test(AVD) - 11.xml#L0
Failed test found in: sentry-android-integration-tests/sentry-uitest-android/build/outputs/androidTest-results/connected/release/TEST-test(AVD) - 11.xml Error: org.junit.AssumptionViolatedException: got: <[null]>, expected: every item is not null
io.sentry.uitest.android.EnvelopeTests ► checkTimedOutProfile: sentry-android-integration-tests/sentry-uitest-android/build/outputs/androidTest-results/connected/release/TEST-test(AVD) - 11.xml#L0
Failed test found in: sentry-android-integration-tests/sentry-uitest-android/build/outputs/androidTest-results/connected/release/TEST-test(AVD) - 11.xml Error: org.junit.AssumptionViolatedException: Sometimes traceFile does not exist for profiles on emulators and it fails. Although, Android Runtime is the one that manages the file, so something must be wrong with Debug.startMethodTracing
io.sentry.uitest.android.AutomaticSpansTest ► checkAppStartFramesMeasurements: sentry-android-integration-tests/sentry-uitest-android/build/outputs/androidTest-results/connected/release/TEST-test(AVD) - 11.xml#L0
Failed test found in: sentry-android-integration-tests/sentry-uitest-android/build/outputs/androidTest-results/connected/release/TEST-test(AVD) - 11.xml Error: org.junit.AssumptionViolatedException: got: <false>, expected: is <true>
io.sentry.uitest.android.UserInteractionTests ► composableSwipeGeneratesMatchingBreadcrumb: sentry-android-integration-tests/sentry-uitest-android/build/outputs/androidTest-results/connected/release/TEST-test(AVD) - 11.xml#L0
Failed test found in: sentry-android-integration-tests/sentry-uitest-android/build/outputs/androidTest-results/connected/release/TEST-test(AVD) - 11.xml Error: org.junit.AssumptionViolatedException: got: <false>, expected: is <true>
io.sentry.uitest.android.UserInteractionTests ► composableClickGeneratesMatchingBreadcrumb: sentry-android-integration-tests/sentry-uitest-android/build/outputs/androidTest-results/connected/release/TEST-test(AVD) - 11.xml#L0
Failed test found in: sentry-android-integration-tests/sentry-uitest-android/build/outputs/androidTest-results/connected/release/TEST-test(AVD) - 11.xml Error: org.junit.AssumptionViolatedException: got: <false>, expected: is <true>
io.sentry.uitest.android.ReplayTest ► composeReplayDoesNotLeak: sentry-android-integration-tests/sentry-uitest-android/build/outputs/androidTest-results/connected/release/TEST-test(AVD) - 11.xml#L0
Failed test found in: sentry-android-integration-tests/sentry-uitest-android/build/outputs/androidTest-results/connected/release/TEST-test(AVD) - 11.xml Error: org.junit.AssumptionViolatedException: got: <false>, expected: is <true>
io.sentry.uitest.android.EnvelopeTests ► checkEnvelopeProfiledTransaction: sentry-android-integration-tests/sentry-uitest-android/build/outputs/androidTest-results/connected/release/TEST-test(AVD) - 11.xml#L0
Failed test found in: sentry-android-integration-tests/sentry-uitest-android/build/outputs/androidTest-results/connected/release/TEST-test(AVD) - 11.xml Error: org.junit.AssumptionViolatedException: got: <[null]>, expected: every item is not null
io.sentry.uitest.android.EnvelopeTests ► checkTimedOutProfile: sentry-android-integration-tests/sentry-uitest-android/build/outputs/androidTest-results/connected/release/TEST-test(AVD) - 11.xml#L0
Failed test found in: sentry-android-integration-tests/sentry-uitest-android/build/outputs/androidTest-results/connected/release/TEST-test(AVD) - 11.xml Error: org.junit.AssumptionViolatedException: Sometimes traceFile does not exist for profiles on emulators and it fails. Although, Android Runtime is the one that manages the file, so something must be wrong with Debug.startMethodTracing
io.sentry.uitest.android.AutomaticSpansTest ► checkAppStartFramesMeasurements: sentry-android-integration-tests/sentry-uitest-android/build/outputs/androidTest-results/connected/release/TEST-test(AVD) - 11.xml#L0
Failed test found in: sentry-android-integration-tests/sentry-uitest-android/build/outputs/androidTest-results/connected/release/TEST-test(AVD) - 11.xml Error: org.junit.AssumptionViolatedException: got: <false>, expected: is <true>
AGP Matrix Release - AGP 9.4.0 - Integrations true
Failed to restore: Failed to GetCacheEntryDownloadURL: Rate limited: Failed request: (429) Too Many Requests: rate limit exceeded
AGP Matrix Release - AGP 9.4.0 - Integrations true
You've hit a rate limit, your rate limit will reset in 8 seconds
AGP Matrix Release - AGP 9.4.0 - Integrations true
Failed to restore gradle-kotlin-dsl-v2-14dac04c8ef520819a7780ad07716b34: Error: Failed to GetCacheEntryDownloadURL: Rate limited: Failed request: (429) Too Many Requests: rate limit exceeded
AGP Matrix Release - AGP 9.4.0 - Integrations true
You've hit a rate limit, your rate limit will reset in 9 seconds
AGP Matrix Release - AGP 9.4.0 - Integrations true
Failed to restore gradle-groovy-dsl-v2-bf158564e4f37055494603731325e7e4: Error: Failed to GetCacheEntryDownloadURL: Rate limited: Failed request: (429) Too Many Requests: rate limit exceeded
AGP Matrix Release - AGP 9.4.0 - Integrations true
You've hit a rate limit, your rate limit will reset in 9 seconds
AGP Matrix Release - AGP 9.4.0 - Integrations true
Failed to restore gradle-build-cache-v2-4b7a02b0d72045567fbfea9686721656: Error: Failed to GetCacheEntryDownloadURL: Rate limited: Failed request: (429) Too Many Requests: rate limit exceeded
AGP Matrix Release - AGP 9.4.0 - Integrations true
You've hit a rate limit, your rate limit will reset in 9 seconds
AGP Matrix Release - AGP 9.4.0 - Integrations true
Failed to restore gradle-instrumented-jars-v2-bb910fcacf708cb42c10c2b5b22b5d19: Error: Failed to GetCacheEntryDownloadURL: Rate limited: Failed request: (429) Too Many Requests: rate limit exceeded
AGP Matrix Release - AGP 9.4.0 - Integrations true
You've hit a rate limit, your rate limit will reset in 9 seconds
AGP Matrix Release - AGP 9.4.0 - Integrations true
Failed to restore gradle-dependencies-v2-b9b06de11942e09bf97231e1219f1539: Error: Failed to GetCacheEntryDownloadURL: Rate limited: Failed request: (429) Too Many Requests: rate limit exceeded
AGP Matrix Release - AGP 9.4.0 - Integrations true
You've hit a rate limit, your rate limit will reset in 9 seconds
AGP Matrix Release - AGP 9.0.0 - Integrations false
"The ubuntu-latest label will migrate to Ubuntu 26 beginning October 19, 2026. For more information, see https://github.com/actions/runner-images/issues/14748"
AGP Matrix Release - AGP 9.2.1 - Integrations true
"The ubuntu-latest label will migrate to Ubuntu 26 beginning October 19, 2026. For more information, see https://github.com/actions/runner-images/issues/14748"
AGP Matrix Release - AGP 9.4.0 - Integrations true
"The ubuntu-latest label will migrate to Ubuntu 26 beginning October 19, 2026. For more information, see https://github.com/actions/runner-images/issues/14748"
AGP Matrix Release - AGP 9.0.0 - Integrations true
"The ubuntu-latest label will migrate to Ubuntu 26 beginning October 19, 2026. For more information, see https://github.com/actions/runner-images/issues/14748"
AGP Matrix Release - AGP 9.4.0 - Integrations false
"The ubuntu-latest label will migrate to Ubuntu 26 beginning October 19, 2026. For more information, see https://github.com/actions/runner-images/issues/14748"
AGP Matrix Release - AGP 9.2.1 - Integrations false
"The ubuntu-latest label will migrate to Ubuntu 26 beginning October 19, 2026. For more information, see https://github.com/actions/runner-images/issues/14748"

Artifacts

Produced during runtime
Name Size Digest
test-results-AGP9.0.0-Integrationsfalse
7.18 MB
sha256:b8f676f3d6b887fe57a07366929ef91c4cc205dcebdd60e40af457095a3897c8
test-results-AGP9.0.0-Integrationstrue
7.3 MB
sha256:78c3fa9347f73e1d34aa1b0e44b336e9bb82c91de641f6c92f8220e32bbdc5f2
test-results-AGP9.2.1-Integrationsfalse
19.1 MB
sha256:609830475913270918ddb1d61266cfa7d19c21e7c652ce4123169fdaa2049f2d
test-results-AGP9.2.1-Integrationstrue
19.4 MB
sha256:bc96baf7be4cdded00fc956002a5d0d34b0345d173e81506bd66a7f4221d96b2
test-results-AGP9.4.0-Integrationsfalse
19.4 MB
sha256:74745f57d2793931d668716c1d27f58d0a79e97e7c6c92200cc0540f57301ef3
test-results-AGP9.4.0-Integrationstrue
19.8 MB
sha256:b369728f429ee7c52c60e5eabad4a0d4909d875bbd493151048bb33405ec0a04